View Issue Details
| ID | Project | Category | View Status | Date Submitted | Last Update |
|---|---|---|---|---|---|
| 0001491 | unreal | installing | public | 2004-01-11 23:32 | 2004-01-15 19:56 |
| Reporter | gauntlet | Assigned To | |||
| Priority | normal | Severity | block | Reproducibility | always |
| Status | closed | Resolution | reopened | ||
| Product Version | 3.2-beta19 | ||||
| Summary | 0001491: Cannot Install | ||||
| Description | (lyote@bell)[~/IRCD/Unreal3.2]# make Building src gcc -I../include -I/home/lyote/IRCD/Unreal3.2/extras/regexp/include -pipe -g -O2 -funsigned-char -I/usr/include -DZIP_LINKS -I/home/lyote/curl/include -DUSE_LIBCURL -export-dynamic -L/usr/lib -c auth.c In file included from auth.c:21: ../include/struct.h:65: tre/regex.h: No such file or directory In file included from auth.c:21: ../include/struct.h:1107: syntax error before `regex_t' ../include/struct.h:1183: syntax error before `regex_t' *** Error code 1 Stop in /home/lyote/IRCD/Unreal3.2/src. *** Error code 1 Stop in /home/lyote/IRCD/Unreal3.2. (lyote@bell)[~/IRCD/Unreal3.2]# gmake Building src gmake[1]: Entering directory `/home/lyote/IRCD/Unreal3.2/src' gcc -I../include -I/home/lyote/IRCD/Unreal3.2/extras/regexp/include -pipe -g -O2 -funsigned-char -I/usr/include -DZIP_LINKS -I/home/lyote/curl/include -DUSE_LIBCURL -export-dynamic -L/usr/lib -c auth.c In file included from auth.c:21: ../include/struct.h:65: tre/regex.h: No such file or directory In file included from auth.c:21: ../include/struct.h:1107: syntax error before `regex_t' ../include/struct.h:1183: syntax error before `regex_t' gmake[1]: *** [auth.o] Error 1 gmake[1]: Leaving directory `/home/lyote/IRCD/Unreal3.2/src' gmake: *** [build] Error 2 | ||||
| 3rd party modules | |||||
|
|
Honestly, I'm getting tired of answering this one. If you're using CVS, you should know how to solve this. ./Config make clean make |
|
|
tried it, didnt work..... |
|
|
Reminder sent to codemastr Its not the usual bug that ur thinking....already did all that |
|
|
Ok first off, rather than posting 5 bugnotes, post 1. And rather than posting the make output 3 times, post it once. When you ran ./Config did it say it was installing TRE? Did it succeed? does /home/lyote/IRCD/Unreal3.2/extras/regexp exist? What about home/lyote/IRCD/Unreal3.2/extras/regexp/include/tre/regex.h ? |
|
|
ok ok sorry, let me run the ./Config again and then i can tell u if it installed the TRE, regex and the other, what part of the Config out put should i find it in......what are the lines that i would see. edited on: 01-12-04 03:43 |
|
|
checking for strerror... yes checking for index... yes checking for strtoul... yes checking for bcopy... yes checking for bcmp... yes checking for bzero... yes checking for strcasecmp... yes checking for inet_addr... yes checking for inet_ntoa... yes checking for inet_netof... yes checking for syslog... yes checking for vsyslog... yes mkdir: /home/lyote/IRCD/Unreal3.2-cvs/tmp: File exists checking for openssl... found in /usr/include/openssl checking for zlib... found in /usr checking for dlopen... yes checking if we need the -export-dynamic flag... yes checking for compiler option to produce PIC... -fPIC -DPIC -shared checking if your system prepends an underscore on symbols... no checking if FD_SETSIZE is large enough to allow 1024 file descriptors... yes extracting TRE regex library configuring TRE regex library checking build system type... i386-unknown-freebsd4.9 checking host system type... i386-unknown-freebsd4.9 checking target system type... i386-unknown-freebsd4.9 checking for a BSD-compatible install... /usr/bin/install -c checking whether build environment is sane... yes checking for gawk... no checking for mawk... no checking for nawk... nawk checking whether make sets $(MAKE)... yes checking for gcc... gcc checking for C compiler default output file name... a.out checking whether the C compiler works... yes checking whether we are cross compiling... no checking for suffix of executables... checking for suffix of object files... o checking whether we are using the GNU C compiler... yes checking whether gcc accepts -g... yes checking for gcc option to accept ANSI C... none needed checking for style of include used by make... GNU checking dependency style of gcc... gcc checking how to run the C preprocessor... gcc -E checking for a BSD-compatible install... /usr/bin/install -c checking for the best optimization flags... unknown checking for C compiler warning flags... -Wall checking for an ANSI C-conforming const... yes checking for inline... inline checking for egrep... grep -E checking for ANSI C header files... yes checking for working alloca.h... no checking for alloca... yes checking for sys/types.h... yes checking for sys/stat.h... yes checking for stdlib.h... yes checking for string.h... yes checking for memory.h... yes checking for strings.h... yes checking for inttypes.h... yes checking for stdint.h... no checking for unistd.h... yes checking getopt.h usability... no checking getopt.h presence... no checking for getopt.h... no checking for getopt_long... no checking for getopt_long in -lgnugetopt... no checking for isascii... yes checking for isblank... yes checking whether NLS is requested... yes checking for msgfmt... /usr/local/bin/msgfmt checking for gmsgfmt... /usr/local/bin/msgfmt checking for xgettext... /usr/local/bin/xgettext checking for msgmerge... /usr/local/bin/msgmerge checking for ld used by GCC... /usr/libexec/elf/ld checking if the linker (/usr/libexec/elf/ld) is GNU ld... yes checking for shared library run path origin... done checking whether NLS is requested... yes checking for GNU gettext in libc... no checking for iconv... no, consider installing GNU libiconv checking for GNU gettext in libintl... no checking whether to use NLS... no checking for a sed that does not truncate output... /usr/bin/sed checking for ld used by gcc... /usr/libexec/elf/ld checking if the linker (/usr/libexec/elf/ld) is GNU ld... yes checking for /usr/libexec/elf/ld option to reload object files... -r checking for BSD-compatible nm... /usr/bin/nm -B checking whether ln -s works... yes checking how to recognise dependent libraries... pass_all checking dlfcn.h usability... yes checking dlfcn.h presence... yes checking for dlfcn.h... yes checking for g++... g++ checking whether we are using the GNU C++ compiler... yes checking whether g++ accepts -g... yes checking dependency style of g++... gcc checking how to run the C++ preprocessor... g++ -E checking for g77... no checking for f77... f77 checking whether we are using the GNU Fortran 77 compiler... yes checking whether f77 accepts -g... yes checking the maximum length of command line arguments... 16384 checking command to parse /usr/bin/nm -B output from gcc object... ok checking for objdir... .libs checking for ar... ar checking for ranlib... ranlib checking for strip... strip checking if gcc static flag works... yes checking if gcc supports -fno-rtti -fno-exceptions... yes checking for gcc option to produce PIC... -fPIC checking if gcc PIC flag -fPIC works... yes checking if gcc supports -c -o file.o... yes checking whether the gcc linker (/usr/libexec/elf/ld) supports shared libraries... yes checking how to hardcode library paths into programs... immediate checking whether stripping libraries is possible... yes checking dynamic linker characteristics... freebsd4.9 ld.so checking if libtool supports shared libraries... yes checking whether to build shared libraries... no checking whether to build static libraries... yes configure: creating libtool appending configuration tag "CXX" to libtool checking for ld used by g++... /usr/libexec/elf/ld checking if the linker (/usr/libexec/elf/ld) is GNU ld... yes checking whether the g++ linker (/usr/libexec/elf/ld) supports shared libraries... yes checking for g++ option to produce PIC... -fPIC checking if g++ PIC flag -fPIC works... yes checking if g++ supports -c -o file.o... yes checking whether the g++ linker (/usr/libexec/elf/ld) supports shared libraries... yes checking how to hardcode library paths into programs... immediate checking whether stripping libraries is possible... yes checking dynamic linker characteristics... freebsd4.9 ld.so appending configuration tag "F77" to libtool checking if libtool supports shared libraries... yes checking whether to build shared libraries... no checking whether to build static libraries... yes checking for f77 option to produce PIC... -fPIC checking if f77 PIC flag -fPIC works... yes checking if f77 supports -c -o file.o... yes checking whether the f77 linker (/usr/libexec/elf/ld) supports shared libraries... yes checking how to hardcode library paths into programs... immediate checking whether stripping libraries is possible... yes checking dynamic linker characteristics... freebsd4.9 ld.so configure: creating ./config.status config.status: creating Makefile config.status: creating lib/Makefile config.status: creating src/Makefile config.status: creating tests/Makefile config.status: creating po/Makefile.in config.status: creating m4/Makefile config.status: creating utils/Makefile config.status: creating tre.pc config.status: creating tre.spec config.status: creating config.h config.status: config.h is unchanged config.status: creating lib/tre-config.h config.status: lib/tre-config.h is unchanged config.status: executing depfiles commands config.status: executing default-1 commands config.status: creating po/POTFILES config.status: creating po/Makefile Configuration summary ===================== TRE is now configured as follows: * Compilation environment CC = gcc CFLAGS = -g -O2 -Wall CPP = gcc -E CPPFLAGS = LD = /usr/libexec/elf/ld LDFLAGS = Use alloca(): yes * TRE options Development-time debugging: no System regex ABI compatibility: no Wide character (wchar_t) support: no (disabled with --disable-wchar) Multibyte character set support: no (disabled with --disable-multibyte) Approximate matching support: yes Build and install agrep: no compiling TRE regex library make: Permission denied installing TRE regex library make: Permission denied configure: creating ./config.status config.status: creating Makefile mv: Makefile: set owner/group (was: 1061/0): Operation not permitted config.status: creating src/modules/Makefile mv: src/modules/Makefile: set owner/group (was: 1061/0): Operation not permitted config.status: creating unreal mv: unreal: set owner/group (was: 1061/0): Operation not permitted config.status: creating ircdcron/ircdchk mv: ircdcron/ircdchk: set owner/group (was: 1061/0): Operation not permitted config.status: creating include/setup.h config.status: include/setup.h is unchanged SSL certificate already existing, no need to regenerate _______________________________________________________________________ | | | UnrealIRCd Compile-Time Config | |_______________________________________________________________________| |_______________________________________________________________________| | | | Now all you have to do is type 'make' and let it compile. When that's | | done, you will receive other instructions on what to do next. | | | |_______________________________________________________________________| |_______________________________________________________________________| | - The UnrealIRCd Team - | | | | * Stskeeps [email protected] | | * codemastr [email protected] | | * Syzop [email protected] | |_______________________________________________________________________| |
|
|
It starts out with "Configuring TRE library" or something to that effect. Everything after that just about is TRE's stuff. Maybe doing something like ./Config -q > somefile would be best? (-q is 'quiet' mode, it just uses whatever ./Config values you used the last time you ran it). That way everything would be easy to search through. |
|
|
i see in the directory (lyote@bell)[~/IRCD/Unreal3.2-cvs/extras]# ls CVS channeldumper.c extras.txt malloc.c tre-0.6.4 burst.c defizzer.c m_rawto.c regex tre.tar.gz (lyote@bell)[~/IRCD/Unreal3.2-cvs/extras]# i do not see the regexp ? should there be one, if so where is it..... |
|
|
Hmm this is certainly interesting. compiling TRE regex library make: Permission denied installing TRE regex library make: Permission denied That is where the problem is. Any idea why it would say you don't have access to use make? |
|
|
interesting, i run into this every now and then. i run a configure but then i get permission denied for make. but then if i run gmake things work out. and other times if i run make it works fine, but if i run gmake it fails with the permission denied. seems buggy in the O/S if u ask me.. Could i change the make in the script to be a gmake ? |
|
|
Yeah, lets give that a try, if that works then all I need to do is add something to use gmake if that exists. Open Unreal-directory/configure and go to line 9880, that should be "make" then 3 lines below that should be "make install" |
|
|
yes gmake did work. i will try to put the configs in place and see if it successfully worked. |
|
|
Now i run into the issue of it not finding libcurl but the curlinstall seems to have successfully completed.... (lyote@bell)[~/IRCD/Unreal3.2-cvs]# ./unreal start Starting UnrealIRCd /usr/libexec/ld-elf.so.1: Shared object "libcurl.so.2" not found Possible error encountered (IRCd seemily not started) ===================================================== Check above for possible errors, and this output of ircd.log. If you cannot solve the problem, read Unreal.nfo on where to get support ===================================================== tail: /home/lyote/IRCD/Unreal3.2-cvs/ircd.log: No such file or directory |
|
|
Your system should NOT be looking for libcurl.so.2 since (if you followed the INSTALL.REMOTEINC and ran ./curlinstall) it specifically says NOT to create dynamic libraries and can therefore only link to a static library. |
|
|
gmake: getcwd: : Permission denied Making all in lib gmake[1]: Entering directory `/home/lyote/libsrc/curl/lib' echo "/* The file is generated automaticly */" > ca-bundle.h echo '#undef CURL_CA_BUNDLE /* unknown */' >> ca-bundle.h gmake all-am gmake[2]: Entering directory `/home/lyote/libsrc/curl/lib' gmake[2]: Nothing to be done for `all-am'. gmake[2]: Leaving directory `/home/lyote/libsrc/curl/lib' gmake[1]: Leaving directory `/home/lyote/libsrc/curl/lib' Making all in src gmake[1]: Entering directory `/home/lyote/libsrc/curl/src' gmake all-am gmake[2]: Entering directory `/home/lyote/libsrc/curl/src' /usr/local/bin/bash ../libtool --mode=link gcc -g -O2 -o curl main.o hugehelp.o urlglob.o writeout.o writeenv.o getpass.o ../lib/libcurl.la -lz -lz gcc -g -O2 -o curl main.o hugehelp.o urlglob.o writeout.o writeenv.o getpass.o ../lib/.libs/libcurl.so -lares -L/home/lyote/libsrc/curl/ares -lssl -lcrypto -lz -Wl,--rpath -Wl,/home/lyote/libsrc/curl/lib/.libs -Wl,--rpath -Wl,/usr/local/lib main.o: In function `main_init': /home/lyote/libsrc/curl/src/main.c:315: undefined reference to `curl_global_init' main.o: In function `main_free': /home/lyote/libsrc/curl/src/main.c:324: undefined reference to `curl_global_cleanup' main.o: In function `SetHTTPrequest': /home/lyote/libsrc/curl/src/main.c:335: undefined reference to `curl_mfprintf' main.o: In function `helpf': /home/lyote/libsrc/curl/src/main.c:346: undefined reference to `curl_mvfprintf' /home/lyote/libsrc/curl/src/main.c:349: undefined reference to `curl_mfprintf' main.o: In function `formparse': /home/lyote/libsrc/curl/src/main.c:902: undefined reference to `curl_strnequal' /home/lyote/libsrc/curl/src/main.c:920: undefined reference to `curl_strnequal' /home/lyote/libsrc/curl/src/main.c:975: undefined reference to `curl_mfprintf' /home/lyote/libsrc/curl/src/main.c:989: undefined reference to `curl_formadd' /home/lyote/libsrc/curl/src/main.c:990: undefined reference to `curl_mfprintf' /home/lyote/libsrc/curl/src/main.c:1002: undefined reference to `curl_formadd' /home/lyote/libsrc/curl/src/main.c:1003: undefined reference to `curl_mfprintf' /home/lyote/libsrc/curl/src/main.c:1011: undefined reference to `curl_formadd' /home/lyote/libsrc/curl/src/main.c:1012: undefined reference to `curl_mfprintf' /home/lyote/libsrc/curl/src/main.c:1021: undefined reference to `curl_mfprintf' /home/lyote/libsrc/curl/src/main.c:908: undefined reference to `curl_mfprintf' /home/lyote/libsrc/curl/src/main.c:953: undefined reference to `curl_mfprintf' main.o: In function `checkpasswd': /home/lyote/libsrc/curl/src/main.c:1091: undefined reference to `curl_msnprintf' main.o: In function `getparameter': /home/lyote/libsrc/curl/src/main.c:1242: undefined reference to `curl_strnequal' /home/lyote/libsrc/curl/src/main.c:1250: undefined reference to `curl_strequal' /home/lyote/libsrc/curl/src/main.c:1522: undefined reference to `curl_strequal' /home/lyote/libsrc/curl/src/main.c:1545: undefined reference to `curl_strequal' /home/lyote/libsrc/curl/src/main.c:1565: undefined reference to `curl_maprintf' /home/lyote/libsrc/curl/src/main.c:1680: undefined reference to `curl_slist_append' /home/lyote/libsrc/curl/src/main.c:1809: undefined reference to `curl_slist_append' /home/lyote/libsrc/curl/src/main.c:1814: undefined reference to `curl_slist_append' /home/lyote/libsrc/curl/src/main.c:1817: undefined reference to `curl_slist_append' /home/lyote/libsrc/curl/src/main.c:1840: undefined reference to `curl_slist_append' /home/lyote/libsrc/curl/src/main.c:1892: undefined reference to `curl_version' /home/lyote/libsrc/curl/src/main.c:1892: undefined reference to `curl_mprintf' /home/lyote/libsrc/curl/src/main.c:1894: undefined reference to `curl_mprintf' /home/lyote/libsrc/curl/src/main.c:1894: undefined reference to `curl_mprintf' /home/lyote/libsrc/curl/src/main.c:1917: undefined reference to `curl_mprintf' /home/lyote/libsrc/curl/src/main.c:1917: undefined reference to `curl_mprintf' /home/lyote/libsrc/curl/src/main.c:1933: undefined reference to `curl_strequal' /home/lyote/libsrc/curl/src/main.c:1986: undefined reference to `curl_getdate' main.o: In function `parseconfig': /home/lyote/libsrc/curl/src/main.c:2026: undefined reference to `curl_getenv' /home/lyote/libsrc/curl/src/main.c:2032: undefined reference to `curl_msnprintf' /home/lyote/libsrc/curl/src/main.c:2035: undefined reference to `curl_free' /home/lyote/libsrc/curl/src/main.c:2174: undefined reference to `curl_mfprintf' main.o: In function `myprogress': /home/lyote/libsrc/curl/src/main.c:2341: undefined reference to `curl_mfprintf' /home/lyote/libsrc/curl/src/main.c:2354: undefined reference to `curl_msprintf' /home/lyote/libsrc/curl/src/main.c:2355: undefined reference to `curl_msprintf' /home/lyote/libsrc/curl/src/main.c:2356: undefined reference to `curl_mfprintf' main.o: In function `progressbarinit': /home/lyote/libsrc/curl/src/main.c:2387: undefined reference to `curl_getenv' /home/lyote/libsrc/curl/src/main.c:2390: undefined reference to `curl_free' main.o: In function `dump': /home/lyote/libsrc/curl/src/main.c:2423: undefined reference to `curl_mfprintf' /home/lyote/libsrc/curl/src/main.c:2427: undefined reference to `curl_mfprintf' /home/lyote/libsrc/curl/src/main.c:2433: undefined reference to `curl_mfprintf' /home/lyote/libsrc/curl/src/main.c:2445: undefined reference to `curl_mfprintf' main.o: In function `my_trace': /home/lyote/libsrc/curl/src/main.c:2469: undefined reference to `curl_strequal' /home/lyote/libsrc/curl/src/main.c:2483: undefined reference to `curl_mfprintf' main.o: In function `free_config_fields': /home/lyote/libsrc/curl/src/main.c:2535: undefined reference to `curl_formfree' /home/lyote/libsrc/curl/src/main.c:2543: undefined reference to `curl_slist_free_all' /home/lyote/libsrc/curl/src/main.c:2544: undefined reference to `curl_slist_free_all' /home/lyote/libsrc/curl/src/main.c:2544: undefined reference to `curl_slist_free_all' main.o: In function `operate': /home/lyote/libsrc/curl/src/main.c:2639: undefined reference to `curl_version_info' /home/lyote/libsrc/curl/src/main.c:2658: undefined reference to `curl_strnequal' /home/lyote/libsrc/curl/src/main.c:2681: undefined reference to `curl_strequal' /home/lyote/libsrc/curl/src/main.c:2734: undefined reference to `curl_version' /home/lyote/libsrc/curl/src/main.c:2734: undefined reference to `curl_msnprintf' /home/lyote/libsrc/curl/src/main.c:2752: undefined reference to `curl_getenv' /home/lyote/libsrc/curl/src/main.c:2755: undefined reference to `curl_free' /home/lyote/libsrc/curl/src/main.c:2785: undefined reference to `curl_easy_init' /home/lyote/libsrc/curl/src/main.c:2928: undefined reference to `curl_mfprintf' /home/lyote/libsrc/curl/src/main.c:2875: undefined reference to `curl_strequal' /home/lyote/libsrc/curl/src/main.c:2889: undefined reference to `curl_strequal' /home/lyote/libsrc/curl/src/main.c:2975: undefined reference to `curl_strequal' /home/lyote/libsrc/curl/src/main.c:3004: undefined reference to `curl_escape' /home/lyote/libsrc/curl/src/main.c:3018: undefined reference to `curl_msprintf' /home/lyote/libsrc/curl/src/main.c:3020: undefined reference to `curl_free' /home/lyote/libsrc/curl/src/main.c:3044: undefined reference to `curl_strequal' /home/lyote/libsrc/curl/src/main.c:3058: undefined reference to `curl_mfprintf' /home/lyote/libsrc/curl/src/main.c:3061: undefined reference to `curl_mprintf' /home/lyote/libsrc/curl/src/main.c:3094: undefined reference to `curl_msprintf' /home/lyote/libsrc/curl/src/main.c:3096: undefined reference to `curl_msprintf' /home/lyote/libsrc/curl/src/main.c:3112: undefined reference to `curl_easy_setopt' /home/lyote/libsrc/curl/src/main.c:3115: undefined reference to `curl_easy_setopt' /home/lyote/libsrc/curl/src/main.c:3117: undefined reference to `curl_easy_setopt' /home/lyote/libsrc/curl/src/main.c:3120: undefined reference to `curl_easy_setopt' /home/lyote/libsrc/curl/src/main.c:3124: undefined reference to `curl_easy_setopt' main.o:/home/lyote/libsrc/curl/src/main.c:3126: more undefined references to `curl_easy_setopt' follow main.o: In function `operate': /home/lyote/libsrc/curl/src/main.c:3298: undefined reference to `curl_easy_perform' /home/lyote/libsrc/curl/src/main.c:3336: undefined reference to `curl_mfprintf' /home/lyote/libsrc/curl/src/main.c:3339: undefined reference to `curl_mfprintf' /home/lyote/libsrc/curl/src/main.c:3345: undefined reference to `curl_mfprintf' /home/lyote/libsrc/curl/src/main.c:3346: undefined reference to `curl_strequal' /home/lyote/libsrc/curl/src/main.c:3355: undefined reference to `curl_easy_getinfo' /home/lyote/libsrc/curl/src/main.c:3423: undefined reference to `curl_easy_cleanup' main.o: In function `create_dir_hierarchy': /home/lyote/libsrc/curl/src/main.c:3504: undefined reference to `curl_msprintf' /home/lyote/libsrc/curl/src/main.c:3509: undefined reference to `curl_msprintf' /home/lyote/libsrc/curl/src/main.c:3545: undefined reference to `curl_mfprintf' urlglob.o: In function `glob_set': /home/lyote/libsrc/curl/src/urlglob.c:129: undefined reference to `curl_msnprintf' urlglob.o: In function `glob_range': /home/lyote/libsrc/curl/src/urlglob.c:225: undefined reference to `curl_msnprintf' urlglob.o: In function `glob_url': /home/lyote/libsrc/curl/src/urlglob.c:306: undefined reference to `curl_msnprintf' /home/lyote/libsrc/curl/src/urlglob.c:325: undefined reference to `curl_mfprintf' urlglob.o: In function `glob_next_url': /home/lyote/libsrc/curl/src/urlglob.c:394: undefined reference to `curl_mprintf' /home/lyote/libsrc/curl/src/urlglob.c:420: undefined reference to `curl_msprintf' /home/lyote/libsrc/curl/src/urlglob.c:424: undefined reference to `curl_mprintf' urlglob.o: In function `glob_match_url': /home/lyote/libsrc/curl/src/urlglob.c:477: undefined reference to `curl_msprintf' /home/lyote/libsrc/curl/src/urlglob.c:481: undefined reference to `curl_mprintf' writeout.o: In function `ourWriteOut': /home/lyote/libsrc/curl/src/writeout.c:112: undefined reference to `curl_strequal' /home/lyote/libsrc/curl/src/writeout.c:122: undefined reference to `curl_easy_getinfo' /home/lyote/libsrc/curl/src/writeout.c:127: undefined reference to `curl_easy_getinfo' /home/lyote/libsrc/curl/src/writeout.c:132: undefined reference to `curl_easy_getinfo' /home/lyote/libsrc/curl/src/writeout.c:163: undefined reference to `curl_easy_getinfo' /home/lyote/libsrc/curl/src/writeout.c:168: undefined reference to `curl_easy_getinfo' writeout.o:/home/lyote/libsrc/curl/src/writeout.c:178: more undefined references to `curl_easy_getinfo' follow writeout.o: In function `ourWriteOut': /home/lyote/libsrc/curl/src/writeout.c:179: undefined reference to `curl_mfprintf' /home/lyote/libsrc/curl/src/writeout.c:184: undefined reference to `curl_easy_getinfo' gmake[2]: *** [curl] Error 1 gmake[2]: Leaving directory `/home/lyote/libsrc/curl/src' gmake[1]: *** [all] Error 2 gmake[1]: Leaving directory `/home/lyote/libsrc/curl/src' gmake: *** [all-recursive] Error 1 libcurl has been installed. When running ./Config specify: /home/lyote/curl for the directory you installed libcurl to. |
|
|
something really wrong here :( and i know you are getin tired of helpin me out im sorry |
|
|
ok i changed the curlinstall script also to use gmake, and it worked now, so far. although i ran into an issue with it not wanting to copy the libares.a file into the curl/lib directory but i finally got that to work also. |
|
|
ok i am still geting errors, i dont know what to do i am out of ideas, i have deleted the Unreal3.2 Directory, recreated and made the changes for it to use gmake, used ./Config that ran successfully, ran the ./Curlinstall as well that also showed success. but then run make and i get /home/lyote/IRCD/Unreal3.2/src/url.c:109: undefined reference to `curl_easy_setopt' /home/lyote/IRCD/Unreal3.2/src/url.c:110: undefined reference to `curl_easy_setopt' /home/lyote/IRCD/Unreal3.2/src/url.c:112: undefined reference to `curl_easy_setopt' /home/lyote/IRCD/Unreal3.2/src/url.c:113: undefined reference to `curl_easy_setopt' /home/lyote/IRCD/Unreal3.2/src/url.c:114: undefined reference to `curl_easy_setopt' url.o: In function `download_file': /home/lyote/IRCD/Unreal3.2/src/url.c:141: undefined reference to `curl_easy_init' /home/lyote/IRCD/Unreal3.2/src/url.c:148: undefined reference to `curl_easy_setopt' /home/lyote/IRCD/Unreal3.2/src/url.c:149: undefined reference to `curl_easy_setopt' /home/lyote/IRCD/Unreal3.2/src/url.c:150: undefined reference to `curl_easy_setopt' /home/lyote/IRCD/Unreal3.2/src/url.c:152: undefined reference to `curl_easy_setopt' /home/lyote/IRCD/Unreal3.2/src/url.c:156: undefined reference to `curl_easy_setopt' /home/lyote/IRCD/Unreal3.2/src/url.c:157: undefined reference to `curl_easy_perform' /home/lyote/IRCD/Unreal3.2/src/url.c:162: undefined reference to `curl_easy_cleanup' url.o: In function `url_init': /home/lyote/IRCD/Unreal3.2/src/url.c:178: undefined reference to `curl_global_init' /home/lyote/IRCD/Unreal3.2/src/url.c:178: undefined reference to `curl_multi_init' url.o: In function `download_file_async': /home/lyote/IRCD/Unreal3.2/src/url.c:198: undefined reference to `curl_easy_init' /home/lyote/IRCD/Unreal3.2/src/url.c:210: undefined reference to `curl_easy_setopt' /home/lyote/IRCD/Unreal3.2/src/url.c:211: undefined reference to `curl_easy_setopt' /home/lyote/IRCD/Unreal3.2/src/url.c:212: undefined reference to `curl_easy_setopt' /home/lyote/IRCD/Unreal3.2/src/url.c:214: undefined reference to `curl_easy_setopt' /home/lyote/IRCD/Unreal3.2/src/url.c:218: undefined reference to `curl_easy_setopt' url.o:/home/lyote/IRCD/Unreal3.2/src/url.c:219: more undefined references to `curl_easy_setopt' follow url.o: In function `download_file_async': /home/lyote/IRCD/Unreal3.2/src/url.c:226: undefined reference to `curl_multi_add_handle' url.o: In function `url_do_transfers_async': /home/lyote/IRCD/Unreal3.2/src/url.c:241: undefined reference to `curl_multi_perform' /home/lyote/IRCD/Unreal3.2/src/url.c:255: undefined reference to `curl_multi_fdset' /home/lyote/IRCD/Unreal3.2/src/url.c:266: undefined reference to `curl_multi_perform' /home/lyote/IRCD/Unreal3.2/src/url.c:275: undefined reference to `curl_easy_getinfo' /home/lyote/IRCD/Unreal3.2/src/url.c:276: undefined reference to `curl_easy_getinfo' /home/lyote/IRCD/Unreal3.2/src/url.c:277: undefined reference to `curl_easy_getinfo' /home/lyote/IRCD/Unreal3.2/src/url.c:296: undefined reference to `curl_easy_cleanup' /home/lyote/IRCD/Unreal3.2/src/url.c:299: undefined reference to `curl_multi_info_read' *** Error code 1 Stop in /home/lyote/IRCD/Unreal3.2/src. *** Error code 1 Stop in /home/lyote/IRCD/Unreal3.2. |
|
|
Finally, ok this bug not can be closed, but i had to make sure everything wuz gmake b4 running the scripts but now that is done. everything has been installed |
|
|
I presume this bug can be closed... hoping I'm guessing right despite the language-confusion ;p. |
| Date Modified | Username | Field | Change |
|---|---|---|---|
| 2004-01-11 23:32 | gauntlet | New Issue | |
| 2004-01-12 00:45 |
|
Status | new => closed |
| 2004-01-12 00:45 |
|
Note Added: 0004653 | |
| 2004-01-12 00:46 | gauntlet | Status | closed => feedback |
| 2004-01-12 00:46 | gauntlet | Resolution | open => reopened |
| 2004-01-12 00:46 | gauntlet | Note Added: 0004654 | |
| 2004-01-12 00:55 | gauntlet | Note Added: 0004658 | |
| 2004-01-12 03:24 |
|
Note Added: 0004659 | |
| 2004-01-12 03:39 | gauntlet | Note Added: 0004660 | |
| 2004-01-12 03:43 | gauntlet | Note Edited: 0004660 | |
| 2004-01-12 03:53 | gauntlet | Note Added: 0004661 | |
| 2004-01-12 03:54 |
|
Note Added: 0004662 | |
| 2004-01-12 03:55 | gauntlet | Note Added: 0004663 | |
| 2004-01-12 03:55 |
|
Note Added: 0004664 | |
| 2004-01-12 03:57 | gauntlet | Note Added: 0004666 | |
| 2004-01-12 04:00 |
|
Note Added: 0004667 | |
| 2004-01-12 04:06 | gauntlet | Note Added: 0004668 | |
| 2004-01-12 04:12 | gauntlet | Note Added: 0004669 | |
| 2004-01-12 04:15 |
|
Note Added: 0004670 | |
| 2004-01-12 04:31 | gauntlet | Note Added: 0004671 | |
| 2004-01-12 04:31 | gauntlet | Note Added: 0004672 | |
| 2004-01-12 04:47 | gauntlet | Note Added: 0004673 | |
| 2004-01-12 04:55 | gauntlet | Note Added: 0004674 | |
| 2004-01-12 05:06 | gauntlet | Note Added: 0004675 | |
| 2004-01-15 19:56 | syzop | Status | feedback => closed |
| 2004-01-15 19:56 | syzop | Note Added: 0004687 |